Reaction Details
TargetTrypsin
LigandBDBM50122190
Substrate/Competitorn/a
Meas. Tech.ChEMBL_212855 (CHEMBL817807)
Ki 2000±n/a nM
Citation Sanderson, PECutrona, KJDyer, DLKrueger, JAKuo, LCLewis, SDLucas, BJYan, Y Small, low nanomolar, noncovalent thrombin inhibitors lacking a group to fill the 'distal binding pocket'. Bioorg Med Chem Lett13:161-4 (2002) Trypsin
Name:Trypsin
Synonyms:Serine protease 1/Trypsin-2/Trypsin-3
Type:n/a
Mol. Mass.:n/a
Description:ASSAY_ID of ChEMBL is 2155713
Components:This complex has 3 components.
Component 1
Name:Serine protease 1
Type:Enzyme
Mol. Mass.:26557.80
Organism:Homo sapiens (Human)
Description:P07477
Residue:247
Component 2
Name:Trypsin-2
Synonyms:Anionic trypsinogen Serine protease 2 TRY2_HUMAN Thrombin & trypsin Trypsin II | Trypsin-2
Type:PROTEIN
Mol. Mass.:26479.43
Organism:Homo sapiens (Human)
Description:ChEMBL_41517
Residue:247
Component 3
Name:Trypsin-3
Synonyms:Brain trypsinogen PRSS3 Serine protease 3 TRY3 TRY4 Trypsin Trypsin IV | Trypsin-3
Type:PROTEIN
Mol. Mass.:32532.52
Organism:Homo sapiens (Human)
Description:ChEMBL_216043
Residue:304
BDBM50122190
NameBDBM50122190
Synonyms:CHEMBL296737 | N-(5-chloro-2-ethylcarbamoylmethoxy-benzyl)-2-(6-methyl-2-oxo-3-phenylmethanesulfonylamino-2H-pyridin-1-yl)-acetamide
TypeSmall organic molecule
Emp. Form.C26H29ClN4O6S
Mol. Mass.561.05
SMILESCCNC(=O)COc1ccc(Cl)cc1CNC(=O)Cn1c(C)ccc(NS(=O)(=O)Cc2ccccc2)c1=O