Reaction Details
TargetTranslocator protein
LigandBDBM50122294
Substrate/Competitorn/a
Meas. Tech.ChEBML_37636
IC50 0.770000±n/a nM
Citation Zhang, MRMaeda, JFurutsuka, KYoshida, YOgawa, MSuhara, TSuzuki, K [18F]FMDAA1106 and [18F]FEDAA1106: two positron-emitter labeled ligands for peripheral benzodiazepine receptor (PBR). Bioorg Med Chem Lett13:201-4 (2002) Translocator protein
Name:Translocator protein
Type:Mitochondrion membrane protein
Mol. Mass.:18945.84
Organism:Rattus norvegicus (rat)
Description:Competitive binding experiments were performed on rat kidney mitochondrial membranes.
Residue:169
BDBM50122294
NameBDBM50122294
Synonyms:CHEMBL292092 N-[2-(2-Fluoro-ethoxy)-5-methoxy-benzyl]-N-(5-fluoro-2-phenoxy-phenyl)-acetamide
TypeSmall organic molecule
Emp. Form.C24H23F2NO4
Mol. Mass.427.4405
SMILESCOc1ccc(OCCF)c(CN(C(C)=O)c2cc(F)ccc2Oc2ccccc2)c1