Reaction Details
TargetGlutamate receptor ionotropic, NMDA 1
LigandBDBM50122590
Substrate/Competitorn/a
Meas. Tech.ChEMBL_141417 (CHEMBL752321)
Ki 22±n/a nM
Citation Jansen, MPotschka, HBrandt, CLöscher, WDannhardt, G Hydantoin-substituted 4,6-dichloroindole-2-carboxylic acids as ligands with high affinity for the glycine binding site of the NMDA receptor. J Med Chem46:64-73 (2002) 
 
Glutamate receptor ionotropic, NMDA 1
Name:Glutamate receptor ionotropic, NMDA 1
Type:Enzyme Catalytic Domain
Mol. Mass.:105397.81
Organism:Homo sapiens (Human)
Description:Q05586
Residue:938
BDBM50122590
NameBDBM50122590
Synonyms:4,6-Dichloro-3-(2,4-dioxo-3-phenyl-imidazolidin-1-ylmethyl)-1H-indole-2-carboxylic acid | CHEMBL163034
TypeSmall organic molecule
Emp. Form.C19H13Cl2N3O4
Mol. Mass.418.23
SMILESOC(=O)c1[nH]c2cc(Cl)cc(Cl)c2c1Cn1cc(O)n(-c2ccccc2)c1=O