Reaction Details
TargetGlutamate receptor ionotropic, NMDA 1
LigandBDBM50122591
Substrate/Competitorn/a
Meas. Tech.ChEMBL_141417 (CHEMBL752321)
Ki 72.0±n/a nM
Citation Jansen, MPotschka, HBrandt, CLöscher, WDannhardt, G Hydantoin-substituted 4,6-dichloroindole-2-carboxylic acids as ligands with high affinity for the glycine binding site of the NMDA receptor. J Med Chem46:64-73 (2002) 
 
Glutamate receptor ionotropic, NMDA 1
Name:Glutamate receptor ionotropic, NMDA 1
Type:Enzyme Catalytic Domain
Mol. Mass.:105397.81
Organism:Homo sapiens (Human)
Description:Q05586
Residue:938
BDBM50122591
NameBDBM50122591
Synonyms:4,6-dichloro-3-[({[(phenylsulfonyl)amino]carbonyl}amino)methyl]-1H-indole-2-carboxylic acid | CHEMBL159739
TypeSmall organic molecule
Emp. Form.C17H13Cl2N3O5S
Mol. Mass.442.273
SMILESOC(=O)c1[nH]c2cc(Cl)cc(Cl)c2c1CNC(=O)NS(=O)(=O)c1ccccc1