Reaction Details
TargetGlutamate receptor ionotropic, NMDA 1
LigandBDBM50122594
Substrate/Competitorn/a
Meas. Tech.ChEMBL_141417 (CHEMBL752321)
Ki 14±n/a nM
Citation Jansen, MPotschka, HBrandt, CLöscher, WDannhardt, G Hydantoin-substituted 4,6-dichloroindole-2-carboxylic acids as ligands with high affinity for the glycine binding site of the NMDA receptor. J Med Chem46:64-73 (2002) 
 
Glutamate receptor ionotropic, NMDA 1
Name:Glutamate receptor ionotropic, NMDA 1
Type:Enzyme Catalytic Domain
Mol. Mass.:105397.81
Organism:Homo sapiens (Human)
Description:Q05586
Residue:938
BDBM50122594
NameBDBM50122594
Synonyms:4,6-Dichloro-3-[(3-phenyl-ureido)-methyl]-1H-indole-2-carboxylic acid | CHEMBL162293
TypeSmall organic molecule
Emp. Form.C17H13Cl2N3O3
Mol. Mass.378.209
SMILESOC(=O)c1[nH]c2cc(Cl)cc(Cl)c2c1CNC(=O)Nc1ccccc1