Reaction Details
TargetGlutamate receptor ionotropic, NMDA 1
LigandBDBM50122599
Substrate/Competitorn/a
Meas. Tech.ChEMBL_141417 (CHEMBL752321)
Ki 1000±n/a nM
Citation Jansen, MPotschka, HBrandt, CLöscher, WDannhardt, G Hydantoin-substituted 4,6-dichloroindole-2-carboxylic acids as ligands with high affinity for the glycine binding site of the NMDA receptor. J Med Chem46:64-73 (2002) 
 
Glutamate receptor ionotropic, NMDA 1
Name:Glutamate receptor ionotropic, NMDA 1
Type:Enzyme Catalytic Domain
Mol. Mass.:105397.81
Organism:Homo sapiens (Human)
Description:Q05586
Residue:938
BDBM50122599
NameBDBM50122599
Synonyms:4,6-Dichloro-3-(3-ethyl-2,4-dioxo-imidazolidin-1-ylmethyl)-1H-indole-2-carboxylic acid | CHEMBL162435
TypeSmall organic molecule
Emp. Form.C15H13Cl2N3O4
Mol. Mass.370.187
SMILESCCn1c(O)cn(Cc2c([nH]c3cc(Cl)cc(Cl)c23)C(O)=O)c1=O