Reaction Details
TargetGlutamate receptor ionotropic, NMDA 1
LigandBDBM50122604
Substrate/Competitorn/a
Meas. Tech.ChEMBL_141417 (CHEMBL752321)
Ki 990±n/a nM
Citation Jansen, MPotschka, HBrandt, CLöscher, WDannhardt, G Hydantoin-substituted 4,6-dichloroindole-2-carboxylic acids as ligands with high affinity for the glycine binding site of the NMDA receptor. J Med Chem46:64-73 (2002) 
 
Glutamate receptor ionotropic, NMDA 1
Name:Glutamate receptor ionotropic, NMDA 1
Type:Enzyme Catalytic Domain
Mol. Mass.:105397.81
Organism:Homo sapiens (Human)
Description:Q05586
Residue:938
BDBM50122604
NameBDBM50122604
Synonyms:3-(Benzenesulfonylamino-methyl)-4,6-dichloro-1H-indole-2-carboxylic acid | CHEMBL164322
TypeSmall organic molecule
Emp. Form.C16H12Cl2N2O4S
Mol. Mass.399.248
SMILESOC(=O)c1[nH]c2cc(Cl)cc(Cl)c2c1CNS(=O)(=O)c1ccccc1