Reaction Details
TargetGlutamate receptor ionotropic, NMDA 1
LigandBDBM50122611
Substrate/Competitorn/a
Meas. Tech.ChEMBL_141417 (CHEMBL752321)
Ki 36±n/a nM
Citation Jansen, MPotschka, HBrandt, CLöscher, WDannhardt, G Hydantoin-substituted 4,6-dichloroindole-2-carboxylic acids as ligands with high affinity for the glycine binding site of the NMDA receptor. J Med Chem46:64-73 (2002) 
 
Glutamate receptor ionotropic, NMDA 1
Name:Glutamate receptor ionotropic, NMDA 1
Type:Enzyme Catalytic Domain
Mol. Mass.:105397.81
Organism:Homo sapiens (Human)
Description:Q05586
Residue:938
BDBM50122611
NameBDBM50122611
Synonyms:4,6-Dichloro-3-(2,4-dioxo-3-p-tolyl-imidazolidin-1-ylmethyl)-1H-indole-2-carboxylic acid | CHEMBL352071
TypeSmall organic molecule
Emp. Form.C20H15Cl2N3O4
Mol. Mass.432.257
SMILESCc1ccc(cc1)-n1c(O)cn(Cc2c([nH]c3cc(Cl)cc(Cl)c23)C(O)=O)c1=O