Reaction Details
TargetPurine nucleoside phosphorylase
LigandBDBM50122726
Substrate/Competitorn/a
Meas. Tech.ChEMBL_162004 (CHEMBL764175)
Ki 0.023±n/a nM
Citation Evans, GBFurneaux, RHGainsford, GJHanson, JCKicska, GASauve, AASchramm, VLTyler, PC 8-Aza-immucillins as transition-state analogue inhibitors of purine nucleoside phosphorylase and nucleoside hydrolases. J Med Chem46:155-60 (2002) 
 
Purine nucleoside phosphorylase
Name:Purine nucleoside phosphorylase
Type:Enzyme
Mol. Mass.:32035.18
Organism:Bos taurus (bovine)
Description:n/a
Residue:289
BDBM50122726
NameBDBM50122726
Synonyms:2-Hydroxymethyl-5-(4-hydroxy-5H-pyrrolo[3,2-d]pyrimidin-7-yl)-pyrrolidine-3,4-diol | CHEMBL288187
TypeSmall organic molecule
Emp. Form.C11H14N4O4
Mol. Mass.266.2533
SMILESOC[C@H]1NC([C@@H](O)[C@H]1O)c1c[nH]c2c1nc[nH]c2=O