Reaction Details
TargetVasopressin V1a receptor
LigandBDBM50560299
Substrate/Competitorn/a
Meas. Tech.ChEMBL_2071783 (CHEMBL4727317)
IC50 2.4±n/a nM
Citation Szántó, GMakó, ABaska, FBozó, ÉDomány-Kovács, KKurkó, DCselenyák, AMohácsi, RKordás, KSBata, I New V1a receptor antagonist. Part 1. Synthesis and SAR development of urea derivatives. Bioorg Med Chem Lett30:0 (2020) 
 
Vasopressin V1a receptor
Name:Vasopressin V1a receptor
Type:Receptor
Mol. Mass.:46820.18
Organism:Homo sapiens (Human)
Description:P37288
Residue:418
BDBM50560299
NameBDBM50560299
Synonyms:CHEMBL4756212
TypeSmall organic molecule
Emp. Form.C27H32ClN3O2
Mol. Mass.466.015
SMILESCc1ccccc1N1CCN(CC1)C(=O)N1C[C@H](Cc2cc(Cl)ccc12)C(=O)C1CCCC1