Reaction Details
TargetAmyloid-beta precursor protein
LigandBDBM50122785
Substrate/Competitorn/a
Meas. Tech.ChEMBL_35791 (CHEMBL649398)
Ki 10.3±n/a nM
Citation Zhuang, ZPKung, MPWilson, ALee, CWPlössl, KHou, CHoltzman, DMKung, HF Structure-activity relationship of imidazo[1,2-a]pyridines as ligands for detecting beta-amyloid plaques in the brain. J Med Chem46:237-43 (2003) 
 
Amyloid-beta precursor protein
Name:Amyloid-beta precursor protein
Type:Single-pass type I membrane protein
Mol. Mass.:86890.41
Organism:Homo sapiens (Human)
Description:P05067
Residue:770
BDBM50122785
NameBDBM50122785
Synonyms:4-(6-bromoH-imidazo[1,2-a]pyridin-2-yl)-N,N-dimethylbenzenamine [4-(6-Bromo-imidazo[1,2-a]pyridin-2-yl)-phenyl]-dimethyl-amine
TypeSmall organic molecule
Emp. Form.C15H14BrN3
Mol. Mass.316.196
SMILESCN(C)c1ccc(cc1)-c1cn2cc(Br)ccc2n1