Reaction Details
TargetCarnitine O-palmitoyltransferase 1, liver isoform
LigandBDBM50122829
Substrate/Competitorn/a
Meas. Tech.ChEMBL_46326 (CHEMBL660894)
IC50>300000±n/a nM
Citation Giannessi, FPessotto, PTassoni, EChiodi, PConti, RDe Angelis, FDell'Uomo, NCatini, RDeias, RTinti, MOCarminati, PArduini, A Discovery of a long-chain carbamoyl aminocarnitine derivative, a reversible carnitine palmitoyltransferase inhibitor with antiketotic and antidiabetic activity. J Med Chem46:303-9 (2003) 
 
Carnitine O-palmitoyltransferase 1, liver isoform
Name:Carnitine O-palmitoyltransferase 1, liver isoform
Type:PROTEIN
Mol. Mass.:88147.11
Organism:Rattus norvegicus
Description:ChEMBL_887445
Residue:773
BDBM50122829
NameBDBM50122829
Synonyms:(3-Carboxy-2-octyloxycarbonylamino-propyl)-trimethyl-ammonium | CHEMBL104447
TypeSmall organic molecule
Emp. Form.C16H32N2O4
Mol. Mass.316.4363
SMILESCCCCCCCCOC(=O)N[C@@H](CC([O-])=O)C[N+](C)(C)C