Reaction Details
TargetCarnitine O-palmitoyltransferase 1, muscle isoform
LigandBDBM50122834
Substrate/Competitorn/a
Meas. Tech.ChEMBL_46329 (CHEMBL874517)
IC50>120000±n/a nM
Citation Giannessi, FPessotto, PTassoni, EChiodi, PConti, RDe Angelis, FDell'Uomo, NCatini, RDeias, RTinti, MOCarminati, PArduini, A Discovery of a long-chain carbamoyl aminocarnitine derivative, a reversible carnitine palmitoyltransferase inhibitor with antiketotic and antidiabetic activity. J Med Chem46:303-9 (2003) 
 
Carnitine O-palmitoyltransferase 1, muscle isoform
Name:Carnitine O-palmitoyltransferase 1, muscle isoform
Type:PROTEIN
Mol. Mass.:88241.28
Organism:Rattus norvegicus
Description:ChEMBL_887447
Residue:772
BDBM50122834
NameBDBM50122834
Synonyms:CHEMBL105314 | [3-Carboxy-2-(3-dodecyl-ureido)-propyl]-trimethyl-ammonium
TypeSmall organic molecule
Emp. Form.C20H41N3O3
Mol. Mass.371.5578
(=O)N[C@H](CC([O-])=O)C[N+](C)(C)C