Reaction Details
TargetCarnitine O-palmitoyltransferase 1, muscle isoform
LigandBDBM50101600
Substrate/Competitorn/a
Meas. Tech.ChEMBL_46329 (CHEMBL874517)
IC50>10000±n/a nM
Citation Giannessi, FPessotto, PTassoni, EChiodi, PConti, RDe Angelis, FDell'Uomo, NCatini, RDeias, RTinti, MOCarminati, PArduini, A Discovery of a long-chain carbamoyl aminocarnitine derivative, a reversible carnitine palmitoyltransferase inhibitor with antiketotic and antidiabetic activity. J Med Chem46:303-9 (2003) 
 
Carnitine O-palmitoyltransferase 1, muscle isoform
Name:Carnitine O-palmitoyltransferase 1, muscle isoform
Type:PROTEIN
Mol. Mass.:88241.28
Organism:Rattus norvegicus
Description:ChEMBL_887447
Residue:772
BDBM50101600
NameBDBM50101600
Synonyms:CHEMBL305897 [3-Carboxy-2-(undecylaminosulphonyl-amino)-propyl]-trimethyl-ammonium
TypeSmall organic molecule
Emp. Form.C18H39N3O4S
Mol. Mass.393.585
SMILESCCCCCCCCCCCNS(=O)(=O)N[C@@H](CC([O-])=O)C[N+](C)(C)C