Reaction Details
TargetCarnitine O-palmitoyltransferase 1, liver isoform
LigandBDBM50122837
Substrate/Competitorn/a
Meas. Tech.ChEMBL_46326 (CHEMBL660894)
IC50 43600.0±n/a nM
Citation Giannessi, FPessotto, PTassoni, EChiodi, PConti, RDe Angelis, FDell'Uomo, NCatini, RDeias, RTinti, MOCarminati, PArduini, A Discovery of a long-chain carbamoyl aminocarnitine derivative, a reversible carnitine palmitoyltransferase inhibitor with antiketotic and antidiabetic activity. J Med Chem46:303-9 (2003) 
 
Carnitine O-palmitoyltransferase 1, liver isoform
Name:Carnitine O-palmitoyltransferase 1, liver isoform
Type:PROTEIN
Mol. Mass.:88147.11
Organism:Rattus norvegicus
Description:ChEMBL_887445
Residue:773
BDBM50122837
NameBDBM50122837
Synonyms:CHEMBL319635 | [3-Carboxy-2-(3-heptyl-ureido)-propyl]-trimethyl-ammonium
TypeSmall organic molecule
Emp. Form.C15H31N3O3
Mol. Mass.301.4249
SMILESCCCCCCCNC(=O)N[C@H](CC([O-])=O)C[N+](C)(C)C