Reaction Details
TargetCarnitine O-palmitoyltransferase 1, liver isoform
LigandBDBM50101604
Substrate/Competitorn/a
Meas. Tech.ChEMBL_46326 (CHEMBL660894)
IC50 700±n/a nM
Citation Giannessi, FPessotto, PTassoni, EChiodi, PConti, RDe Angelis, FDell'Uomo, NCatini, RDeias, RTinti, MOCarminati, PArduini, A Discovery of a long-chain carbamoyl aminocarnitine derivative, a reversible carnitine palmitoyltransferase inhibitor with antiketotic and antidiabetic activity. J Med Chem46:303-9 (2003) 
 
Carnitine O-palmitoyltransferase 1, liver isoform
Name:Carnitine O-palmitoyltransferase 1, liver isoform
Type:PROTEIN
Mol. Mass.:88147.11
Organism:Rattus norvegicus
Description:ChEMBL_887445
Residue:773
BDBM50101604
NameBDBM50101604
Synonyms:CHEMBL309568 | [3-Carboxy-2-(dodecane-1-sulfonylamino)-propyl]-trimethyl-ammonium
TypeSmall organic molecule
Emp. Form.C19H40N2O4S
Mol. Mass.392.597
SMILESCCCCCCCCCCCCS(=O)(=O)N[C@@H](CC([O-])=O)C[N+](C)(C)C