Reaction Details
TargetProtein kinase C alpha type
LigandBDBM50122940
Substrate/Competitorn/a
Meas. Tech.ChEMBL_160297 (CHEMBL769625)
Ki 12±n/a nM
Citation Kozikowski, APNowak, IPetukhov, PAEtcheberrigaray, RMohamed, ATan, MLewin, NHennings, HPearce, LLBlumberg, PM New amide-bearing benzolactam-based protein kinase C modulators induce enhanced secretion of the amyloid precursor protein metabolite sAPPalpha. J Med Chem46:364-73 (2003) 
 
Protein kinase C alpha type
Name:Protein kinase C alpha type
Type:Enzyme
Mol. Mass.:76755.65
Organism:Homo sapiens (Human)
Description:The recombinant human PKC enzymes were produced using a baculovirus expression system in SF9 cells
Residue:672
BDBM50122940
NameBDBM50122940
Synonyms:(2S,5S)-(E,E)-8-(5-(4-(trifluoromethyl)phenyl)-2,4-pentadienoylamino)benzolactam CHEMBL331344
TypeSmall organic molecule
Emp. Form.C27H30F3N3O3
Mol. Mass.501.5406
SMILESCC(C)[C@@H]1N(C)c2ccc(NC(=O)\C=C\C=C\c3ccc(cc3)C(F)(F)F)cc2C[C@@H](CO)NC1=O