Reaction Details
TargetSodium-dependent serotonin transporter
LigandBDBM50123069
Substrate/Competitorn/a
Meas. Tech.ChEBML_201994
Ki 0.600000±n/a nM
Citation van Hes, RSmid, PStroomer, CNTipker, KTulp, MTvan der Heyden, JAMcCreary, ACHesselink, MBKruse, CG SLV310, a novel, potential antipsychotic, combining potent dopamine D2 receptor antagonism with serotonin reuptake inhibition. Bioorg Med Chem Lett13:405-8 (2003) Sodium-dependent serotonin transporter
Name:Sodium-dependent serotonin transporter
Type:Multi-pass membrane protein
Mol. Mass.:70168.43
Organism:Rattus norvegicus (rat)
Description:P31652
Residue:630
BDBM50123069
NameBDBM50123069
Synonyms:2-(4-(4-(5-fluoro-1H-indol-3-yl)-5,6-dihydropyridin-1(2H)-yl)butyl)isoindoline-1,3-dione CHEMBL131495 | SLV-310
TypeSmall organic molecule
Emp. Form.C25H24FN3O2
Mol. Mass.417.4754
SMILESFc1ccc2[nH]cc(C3=CCN(CCCCN4C(=O)c5ccccc5C4=O)CC3)c2c1