Reaction Details
TargetSodium-dependent serotonin transporter
LigandBDBM50123081
Substrate/Competitorn/a
Meas. Tech.ChEBML_201994
Ki 0.800000±n/a nM
Citation van Hes, RSmid, PStroomer, CNTipker, KTulp, MTvan der Heyden, JAMcCreary, ACHesselink, MBKruse, CG SLV310, a novel, potential antipsychotic, combining potent dopamine D2 receptor antagonism with serotonin reuptake inhibition. Bioorg Med Chem Lett13:405-8 (2003) Sodium-dependent serotonin transporter
Name:Sodium-dependent serotonin transporter
Type:Multi-pass membrane protein
Mol. Mass.:70168.43
Organism:Rattus norvegicus (rat)
Description:P31652
Residue:630
BDBM50123081
NameBDBM50123081
Synonyms:4-Fluoro-2-{5-[4-(1H-indol-3-yl)-3,6-dihydro-2H-pyridin-1-yl]-pentyl}-isoindole-1,3-dione | CHEMBL339098
TypeSmall organic molecule
Emp. Form.C26H26FN3O2
Mol. Mass.431.5019
SMILESFc1cccc2C(=O)N(CCCCCN3CCC(=CC3)c3c[nH]c4ccccc34)C(=O)c12