Reaction Details
TargetEstrogen receptor
LigandBDBM50123212
Substrate/Competitorn/a
Meas. Tech.ChEBML_67033
IC50 58±n/a nM
Citation Blizzard, TAMorgan, JDMosley, RTBirzin, ETFrisch, KRohrer, SPHammond, ML 2-Phenylspiroindenes: a novel class of selective estrogen receptor modulators (SERMs). Bioorg Med Chem Lett13:479-83 (2003) Estrogen receptor
Name:Estrogen receptor
Type:Protein
Mol. Mass.:66230.44
Organism:Homo sapiens (Human)
Description:P03372
Residue:595
BDBM50123212
NameBDBM50123212
Synonyms:2-phenyl-1,2'-spirobi[1H-indene]-5'-ol | CHEMBL439806
TypeSmall organic molecule
Emp. Form.C23H18O
Mol. Mass.310.3884
SMILESOc1ccc2CC3(Cc2c1)C(=Cc1ccccc31)c1ccccc1