Reaction Details
TargetEstrogen receptor beta
LigandBDBM50123206
Substrate/Competitorn/a
Meas. Tech.ChEBML_67193
IC50 23±n/a nM
Citation Blizzard, TAMorgan, JDMosley, RTBirzin, ETFrisch, KRohrer, SPHammond, ML 2-Phenylspiroindenes: a novel class of selective estrogen receptor modulators (SERMs). Bioorg Med Chem Lett13:479-83 (2003) Estrogen receptor beta
Name:Estrogen receptor beta
Type:Protein
Mol. Mass.:59238.43
Organism:Homo sapiens (Human)
Description:Q92731
Residue:530
BDBM50123206
NameBDBM50123206
Synonyms:2-(3-hydroxyphenyl)-1,2'-spirobi[1H-indene]-5-ol | CHEMBL24950
TypeSmall organic molecule
Emp. Form.C23H18O2
Mol. Mass.326.3878
SMILESOc1ccc2c(C=C(c3cccc(O)c3)C22Cc3ccccc3C2)c1