Reaction Details
TargetHistone deacetylase 1
LigandBDBM50398716
Substrate/Competitorn/a
Meas. Tech.ChEMBL_2074035 (CHEMBL4729569)
IC50 151±n/a nM
Citation Noonepalle, SShen, SPtá?ek, JTavares, MTZhang, GStránský, JPavlí?ek, JFerreira, GMHadley, MPelaez, GBa?inka, CKozikowski, APVillagra, A Rational Design of Suprastat: A Novel Selective Histone Deacetylase 6 Inhibitor with the Ability to Potentiate Immunotherapy in Melanoma Models. J Med Chem63:10246-10262 (2020) 
 
Histone deacetylase 1
Name:Histone deacetylase 1
Type:Enzyme
Mol. Mass.:55090.27
Organism:Homo sapiens (Human)
Description:Q13547
Residue:482
BDBM50398716
NameBDBM50398716
Synonyms:CHEMBL2179618 US9409858, 5g US9956192, Compound 5g
TypeSmall organic molecule
Emp. Form.C19H23N3O3
Mol. Mass.341.4042
SMILESCCCCN(Cc1ccc(cc1)C(=O)NO)C(=O)Nc1ccccc1