Reaction Details
TargetNeuronal acetylcholine receptor subunit alpha-7
LigandBDBM50123270
Substrate/Competitorn/a
Meas. Tech.ChEBML_144031
Ki 9.7±n/a nM
Citation Zhang, NTomizawa, MCasida, JE 5-Azidoepibatidine: an exceptionally potent photoaffinity ligand for neuronal alpha 4 beta 2 and alpha 7 nicotinic acetylcholine receptors. Bioorg Med Chem Lett13:525-7 (2003) Neuronal acetylcholine receptor subunit alpha-7
Name:Neuronal acetylcholine receptor subunit alpha-7
Type:n/a
Mol. Mass.:56448.33
Organism:Homo sapiens (Human)
Description: CHRNA7 (NACHRA7)
Residue:502
BDBM50123270
NameBDBM50123270
Synonyms:2-(5-Azido-6-chloro-pyridin-3-yl)-7-aza-bicyclo[2.2.1]heptane azidoepibatidine
TypeSmall organic molecule
Emp. Form.C11H12ClN5
Mol. Mass.249.699
SMILESClc1ncc(cc1N=[N+]=[N-])C1CC2CCC1N2