Reaction Details
TargetTumor necrosis factor receptor superfamily member 1A
LigandBDBM50123286
Substrate/Competitorn/a
Meas. Tech.ChEBML_212214
IC50 790.0±n/a nM
Citation Voss, MECarter, PHTebben, AJScherle, PABrown, GDThompson, LAXu, MLo, YCYang, GLiu, RQStrzemienski, PEverlof, JGTrzaskos, JMDecicco, CP Both 5-arylidene-2-thioxodihydropyrimidine-4,6(1H,5H)-diones and 3-thioxo-2,3-dihydro-1H-imidazo[1,5-a]indol-1-ones are light-dependent tumor necrosis factor-alpha antagonists. Bioorg Med Chem Lett13:533-8 (2003) Tumor necrosis factor receptor superfamily member 1A
Name:Tumor necrosis factor receptor superfamily member 1A
Type:PROTEIN
Mol. Mass.:50495.39
Organism:Homo sapiens (Human)
Description:ChEMBL_1509419
Residue:455
BDBM50123286
NameBDBM50123286
Synonyms:5-(1H-Indol-3-ylmethylene)-2-thioxo-1,3-di-o-tolyl-dihydro-pyrimidine-4,6-dione | CHEMBL347715
TypeSmall organic molecule
Emp. Form.C27H21N3O2S
Mol. Mass.451.54
SMILESCc1ccccc1N1C(=S)N(C(=O)C(=Cc2c[nH]c3ccccc23)C1=O)c1ccccc1C