Reaction Details
TargetProthrombin
LigandBDBM50123497
Substrate/Competitorn/a
Meas. Tech.ChEMBL_210607 (CHEMBL816574)
Ki 0.9±n/a nM
Citation Burgey, CSRobinson, KALyle, TASanderson, PELewis, SDLucas, BJKrueger, JASingh, RMiller-Stein, CWhite, RBWong, BLyle, EAWilliams, PDCoburn, CADorsey, BDBarrow, JCStranieri, MTHolahan, MASitko, GRCook, JJMcMasters, DRMcDonough, CMSanders, WMWallace, AAClayton, FCBohn, DLeonard, YMDetwiler, TJLynch, JJYan, YChen, ZKuo, LGardell, SJShafer, JAVacca, JP Metabolism-directed optimization of 3-aminopyrazinone acetamide thrombin inhibitors. Development of an orally bioavailable series containing P1 and P3 pyridines. J Med Chem46:461-73 (2003) 
 
Prothrombin
Name:Prothrombin
Type:Protein
Mol. Mass.:70029.57
Organism:Homo sapiens (Human)
Description:P00734
Residue:622
BDBM50123497
NameBDBM50123497
Synonyms:2-[6-Chloro-3-(2,2-difluoro-2-pyridin-2-yl-ethylamino)-2-oxo-2H-pyrazin-1-yl]-N-(3-fluoro-4-methyl-pyridin-2-ylmethyl)-acetamide | CHEMBL142240
TypeSmall organic molecule
Emp. Form.C20H18ClF3N6O2
Mol. Mass.466.844
SMILESCc1ccnc(CNC(=O)Cn2c(Cl)cnc(NCC(F)(F)c3ccccn3)c2=O)c1F