Reaction Details
TargetSerine protease 1
LigandBDBM50123486
Substrate/Competitorn/a
Meas. Tech.ChEMBL_212685 (CHEMBL815470)
Ki 61000±n/a nM
Citation Burgey, CSRobinson, KALyle, TASanderson, PELewis, SDLucas, BJKrueger, JASingh, RMiller-Stein, CWhite, RBWong, BLyle, EAWilliams, PDCoburn, CADorsey, BDBarrow, JCStranieri, MTHolahan, MASitko, GRCook, JJMcMasters, DRMcDonough, CMSanders, WMWallace, AAClayton, FCBohn, DLeonard, YMDetwiler, TJLynch, JJYan, YChen, ZKuo, LGardell, SJShafer, JAVacca, JP Metabolism-directed optimization of 3-aminopyrazinone acetamide thrombin inhibitors. Development of an orally bioavailable series containing P1 and P3 pyridines. J Med Chem46:461-73 (2003) 
 
Serine protease 1
Name:Serine protease 1
Type:Enzyme
Mol. Mass.:26557.80
Organism:Homo sapiens (Human)
Description:P07477
Residue:247
BDBM50123486
NameBDBM50123486
Synonyms:2-[6-Cyano-3-(2,2-difluoro-2-pyridin-2-yl-ethylamino)-2-oxo-2H-pyrazin-1-yl]-N-(3-fluoro-4-methyl-pyridin-2-ylmethyl)-acetamide | CHEMBL422299
TypeSmall organic molecule
Emp. Form.C21H18F3N7O2
Mol. Mass.457.4085
SMILESCc1ccnc(CNC(=O)Cn2c(cnc(NCC(F)(F)c3ccccn3)c2=O)C#N)c1F