Reaction Details
TargetProtein disulfide-isomerase
LigandBDBM41982
Substrate/Competitorn/a
Meas. Tech.ChEMBL_2074276 (CHEMBL4729810)
IC50 640±n/a nM
Citation Shergalis, AXue, DGharbia, FZDriks, HShrestha, BTanweer, ACromer, KLjungman, MNeamati, N Characterization of Aminobenzylphenols as Protein Disulfide Isomerase Inhibitors in Glioblastoma Cell Lines. J Med Chem63:10263-10286 (2020) 
 
Protein disulfide-isomerase
Name:Protein disulfide-isomerase
Type:Protein
Mol. Mass.:57084.91
Organism:Homo sapiens (Human)
Description:P07237
Residue:508
BDBM41982
NameBDBM41982
Synonyms:6-[4-morpholinyl-(3,4,5-trimethoxyphenyl)methyl]-1,3-benzodioxol-5-ol 6-[morpholino-(3,4,5-trimethoxyphenyl)methyl]sesamol | cid_339894
TypeSmall organic molecule
Emp. Form.C21H25NO7
Mol. Mass.403.4257
SMILESCOc1cc(cc(OC)c1OC)C(N1CCOCC1)c1cc2OCOc2cc1O