Reaction Details
TargetDNA polymerase I, thermostable
LigandBDBM50123622
Substrate/Competitorn/a
Meas. Tech.ChEMBL_209728 (CHEMBL816426)
IC50 2400±n/a nM
Citation Kim, MYDuan, WGleason-Guzman, MHurley, LH Design, synthesis, and biological evaluation of a series of fluoroquinoanthroxazines with contrasting dual mechanisms of action against topoisomerase II and G-quadruplexes. J Med Chem46:571-83 (2003) 
 
DNA polymerase I, thermostable
Name:DNA polymerase I, thermostable
Type:PROTEIN
Mol. Mass.:93906.95
Organism:Thermus aquaticus
Description:ChEMBL_1289218
Residue:832
BDBM50123622
NameBDBM50123622
Synonyms:6-[3-amino-(3R)-tetrahydro-1H-1-pyrrolyl]-5-fluoro-3-oxo-3H-naphtho[2,1-b]pyrido[3,2,1-kl]phenoxazine-2-carboxylic acid | CHEMBL350251
TypeSmall organic molecule
Emp. Form.C28H20FN3O4
Mol. Mass.481.4745
SMILESN[C@@H]1CCN(C1)c1c(F)cc2c3c1oc1cc4c(ccc5ccccc45)cc1n3cc(C(O)=O)c2=O