Reaction Details
TargetDNA polymerase I, thermostable
LigandBDBM50123624
Substrate/Competitorn/a
Meas. Tech.ChEMBL_209728 (CHEMBL816426)
IC50 670.0±n/a nM
Citation Kim, MYDuan, WGleason-Guzman, MHurley, LH Design, synthesis, and biological evaluation of a series of fluoroquinoanthroxazines with contrasting dual mechanisms of action against topoisomerase II and G-quadruplexes. J Med Chem46:571-83 (2003) 
 
DNA polymerase I, thermostable
Name:DNA polymerase I, thermostable
Type:PROTEIN
Mol. Mass.:93906.95
Organism:Thermus aquaticus
Description:ChEMBL_1289218
Residue:832
BDBM50123624
NameBDBM50123624
Synonyms:(S)-13-(3-aminopyrrolidin-1-yl)-12-fluoro-10-oxo-10H-naphtho[1,2-c]pyrido[3,2,1-kl]phenoxazine-9-carboxylic acid CHEMBL155344
TypeSmall organic molecule
Emp. Form.C28H20FN3O4
Mol. Mass.481.4745
SMILESN[C@H]1CCN(C1)c1c(F)cc2c3c1oc1c4ccc5ccccc5c4ccc1n3cc(C(O)=O)c2=O