Reaction Details
TargetHistone deacetylase 1
LigandBDBM50105692
Substrate/Competitorn/a
Meas. Tech.ChEMBL_87856 (CHEMBL877713)
IC50 100±n/a nM
Citation Bouchain, GLeit, SFrechette, SKhalil, EALavoie, RMoradei, OWoo, SHFournel, MYan, PTKalita, ATrachy-Bourget, MCBeaulieu, CLi, ZRobert, MFMacLeod, ARBesterman, JMDelorme, D Development of potential antitumor agents. Synthesis and biological evaluation of a new set of sulfonamide derivatives as histone deacetylase inhibitors. J Med Chem46:820-30 (2003) 
 
Histone deacetylase 1
Name:Histone deacetylase 1
Type:Enzyme
Mol. Mass.:55090.27
Organism:Homo sapiens (Human)
Description:Q13547
Residue:482
BDBM50105692
NameBDBM50105692
Synonyms:(E)-3-[4-(4-tert-Butyl-benzenesulfonylamino)-phenyl]-N-hydroxy-acrylamide 3-[4-(4-tert-Butyl-benzenesulfonylamino)-phenyl]-N-hydroxy-acrylamide US8796330, 105
TypeSmall organic molecule
Emp. Form.C19H22N2O4S
Mol. Mass.374.454
SMILESCC(C)(C)c1ccc(cc1)S(=O)(=O)Nc1ccc(\C=C\C(=O)NO)cc1