Reaction Details
TargetDelta-type opioid receptor
LigandBDBM50000091
Substrate/Competitorn/a
Meas. Tech.ChEMBL_147150 (CHEMBL758175)
Ki 3.40±n/a nM
Citation Wentland, MPYe, YCioffi, CLLou, RZhou, QXu, GDuan, WDehnhardt, CMSun, XCohen, DJBidlack, JM Syntheses and opioid receptor binding affinities of 8-amino-2,6-methano-3-benzazocines. J Med Chem46:838-49 (2003) 
 
Delta-type opioid receptor
Name:Delta-type opioid receptor
Type:G Protein-Coupled Receptor (GPCR)
Mol. Mass.:40382.98
Organism:Homo sapiens (Human)
Description:Competition binding assays were carried out using membrane preparations from transfected HN9.10 cells that constitutively expressed the delta opioid receptor.
Residue:372
BDBM50000091
NameBDBM50000091
Synonyms:(6S,11R)-3-Cyclopropylmethyl-6-ethyl-8-hydroxy-11-methyl-3,4,5,6-tetrahydro-2H-2,6-methano-benzo[d]azocin-1-one 3-Cyclopropylmethyl-6-ethyl-8-hydroxy-11-methyl-3,4,5,6-tetrahydro-2H-2,6-methano-benzo[d]azocin-1-one 3-Cyclopropylmethyl-6-ethyl-8-hydroxy-11-methyl-3,4,5,6-tetrahydro-2H-2,6-methano-benzo[d]azocin-1-one(Ethylketazocine, EKC) EKC | EKC(-)
TypeSmall organic molecule
Emp. Form.C19H25NO2
Mol. Mass.299.4073
SMILESCC[C@]12CCN(CC3CC3)C([C@@H]1C)C(=O)c1ccc(O)cc21