Reaction Details
TargetMu-type opioid receptor
LigandBDBM50123995
Substrate/Competitorn/a
Meas. Tech.ChEMBL_145281 (CHEMBL751217)
Ki 0.470000±n/a nM
Citation Wentland, MPYe, YCioffi, CLLou, RZhou, QXu, GDuan, WDehnhardt, CMSun, XCohen, DJBidlack, JM Syntheses and opioid receptor binding affinities of 8-amino-2,6-methano-3-benzazocines. J Med Chem46:838-49 (2003) 
 
Mu-type opioid receptor
Name:Mu-type opioid receptor
Type:Enzyme Catalytic Domain
Mol. Mass.:11165.58
Organism:GUINEA PIG
Description:P97266
Residue:98
BDBM50123995
NameBDBM50123995
Synonyms:(3-Cyclopropylmethyl-6,11-dimethyl-1,2,3,4,5,6-hexahydro-2,6-methano-benzo[d]azocin-8-yl)-(4-methoxy-phenyl)-amine | CHEMBL169536
TypeSmall organic molecule
Emp. Form.C25H32N2O
Mol. Mass.376.5344
SMILESCOc1ccc(Nc2ccc3CC4[C@H](C)[C@](C)(CCN4CC4CC4)c3c2)cc1