Reaction Details
TargetKappa-type opioid receptor
LigandBDBM50085024
Substrate/Competitorn/a
Meas. Tech.ChEMBL_146518 (CHEMBL882417)
Ki 4.1±n/a nM
Citation Wentland, MPYe, YCioffi, CLLou, RZhou, QXu, GDuan, WDehnhardt, CMSun, XCohen, DJBidlack, JM Syntheses and opioid receptor binding affinities of 8-amino-2,6-methano-3-benzazocines. J Med Chem46:838-49 (2003) 
 
Kappa-type opioid receptor
Name:Kappa-type opioid receptor
Type:G Protein-Coupled Receptor (GPCR)
Mol. Mass.:42744.99
Organism:Cavia porcellus (domestic guinea pig)
Description:P41144
Residue:380
BDBM50085024
NameBDBM50085024
Synonyms:(6S,11R)-3-Cyclopropylmethyl-6,11-dimethyl-1,2,3,4,5,6-hexahydro-2,6-methano-benzo[d]azocin-8-ylamine 3-Cyclopropylmethyl-6,11-dimethyl-1,2,3,4,5,6-hexahydro-2,6-methano-benzo[d]azocin-8-ylamine.2HCl | CHEMBL52399
TypeSmall organic molecule
Emp. Form.C18H26N2
Mol. Mass.270.4124
SMILESC[C@H]1C2Cc3ccc(N)cc3[C@@]1(C)CCN2CC1CC1