Reaction Details
TargetMu-type opioid receptor
LigandBDBM50123994
Substrate/Competitorn/a
Meas. Tech.ChEMBL_145281 (CHEMBL751217)
Ki 17.0±n/a nM
Citation Wentland, MPYe, YCioffi, CLLou, RZhou, QXu, GDuan, WDehnhardt, CMSun, XCohen, DJBidlack, JM Syntheses and opioid receptor binding affinities of 8-amino-2,6-methano-3-benzazocines. J Med Chem46:838-49 (2003) 
 
Mu-type opioid receptor
Name:Mu-type opioid receptor
Type:Enzyme Catalytic Domain
Mol. Mass.:11165.58
Organism:GUINEA PIG
Description:P97266
Residue:98
BDBM50123994
NameBDBM50123994
Synonyms:8-Amino-3-cyclopropylmethyl-6-ethyl-11-methyl-3,4,5,6-tetrahydro-2H-2,6-methano-benzo[d]azocin-1-one | CHEMBL169346
TypeSmall organic molecule
Emp. Form.C19H26N2O
Mol. Mass.298.4225
SMILESCC[C@]12CCN(CC3CC3)C([C@@H]1C)C(=O)c1ccc(N)cc21