Reaction Details
TargetKappa-type opioid receptor
LigandBDBM50085031
Substrate/Competitorn/a
Meas. Tech.ChEMBL_146518 (CHEMBL882417)
Ki 78±n/a nM
Citation Wentland, MPYe, YCioffi, CLLou, RZhou, QXu, GDuan, WDehnhardt, CMSun, XCohen, DJBidlack, JM Syntheses and opioid receptor binding affinities of 8-amino-2,6-methano-3-benzazocines. J Med Chem46:838-49 (2003) 
 
Kappa-type opioid receptor
Name:Kappa-type opioid receptor
Type:G Protein-Coupled Receptor (GPCR)
Mol. Mass.:42744.99
Organism:Cavia porcellus (domestic guinea pig)
Description:P41144
Residue:380
BDBM50085031
NameBDBM50085031
Synonyms:((6S,11R)-3-Cyclopropylmethyl-6,11-dimethyl-1,2,3,4,5,6-hexahydro-2,6-methano-benzo[d]azocin-8-yl)-isopropyl-amine CHEMBL55434
TypeSmall organic molecule
Emp. Form.C21H32N2
Mol. Mass.312.4922
SMILESCC(C)Nc1ccc2CC3[C@H](C)[C@](C)(CCN3CC3CC3)c2c1