Reaction Details
TargetMu-type opioid receptor
LigandBDBM50085032
Substrate/Competitorn/a
Meas. Tech.ChEMBL_145281 (CHEMBL751217)
Ki 95±n/a nM
Citation Wentland, MPYe, YCioffi, CLLou, RZhou, QXu, GDuan, WDehnhardt, CMSun, XCohen, DJBidlack, JM Syntheses and opioid receptor binding affinities of 8-amino-2,6-methano-3-benzazocines. J Med Chem46:838-49 (2003) 
 
Mu-type opioid receptor
Name:Mu-type opioid receptor
Type:Enzyme Catalytic Domain
Mol. Mass.:11165.58
Organism:GUINEA PIG
Description:P97266
Residue:98
BDBM50085032
NameBDBM50085032
Synonyms:(6S,11R)-3-Cyclopropylmethyl-6,11-dimethyl-8-piperidin-1-yl-1,2,3,4,5,6-hexahydro-2,6-methano-benzo[d]azocine; dihydrochloride CHEMBL543563
TypeSmall organic molecule
Emp. Form.C23H34N2
Mol. Mass.338.5295
SMILESC[C@H]1C2Cc3ccc(cc3[C@@]1(C)CCN2CC1CC1)N1CCCCC1