Reaction Details
TargetMu-type opioid receptor
LigandBDBM50124009
Substrate/Competitorn/a
Meas. Tech.ChEMBL_145281 (CHEMBL751217)
Ki 14±n/a nM
Citation Wentland, MPYe, YCioffi, CLLou, RZhou, QXu, GDuan, WDehnhardt, CMSun, XCohen, DJBidlack, JM Syntheses and opioid receptor binding affinities of 8-amino-2,6-methano-3-benzazocines. J Med Chem46:838-49 (2003) 
 
Mu-type opioid receptor
Name:Mu-type opioid receptor
Type:Enzyme Catalytic Domain
Mol. Mass.:11165.58
Organism:GUINEA PIG
Description:P97266
Residue:98
BDBM50124009
NameBDBM50124009
Synonyms:6,11-Dimethyl-3-(tetrahydro-furan-2-ylmethyl)-1,2,3,4,5,6-hexahydro-2,6-methano-benzo[d]azocin-8-ylamine | CHEMBL2368317
TypeSmall organic molecule
Emp. Form.C19H28N2O
Mol. Mass.300.4384
SMILES[H][C@@]1(CN2CC[C@@]3(C)[C@@H](C)[C@@]2([H])Cc2ccc(N)cc32)CCCO1