Reaction Details
TargetMu-type opioid receptor
LigandBDBM50124003
Substrate/Competitorn/a
Meas. Tech.ChEMBL_145281 (CHEMBL751217)
Ki 7.8±n/a nM
Citation Wentland, MPYe, YCioffi, CLLou, RZhou, QXu, GDuan, WDehnhardt, CMSun, XCohen, DJBidlack, JM Syntheses and opioid receptor binding affinities of 8-amino-2,6-methano-3-benzazocines. J Med Chem46:838-49 (2003) 
 
Mu-type opioid receptor
Name:Mu-type opioid receptor
Type:Enzyme Catalytic Domain
Mol. Mass.:11165.58
Organism:GUINEA PIG
Description:P97266
Residue:98
BDBM50124003
NameBDBM50124003
Synonyms:(3-Cyclopropylmethyl-6,11-dimethyl-1,2,3,4,5,6-hexahydro-2,6-methano-benzo[d]azocin-8-yl)-(4-methoxy-benzyl)-amine | CHEMBL168913
TypeSmall organic molecule
Emp. Form.C26H34N2O
Mol. Mass.390.561
SMILESCOc1ccc(CNc2ccc3CC4[C@H](C)[C@](C)(CCN4CC4CC4)c3c2)cc1