Reaction Details
TargetKappa-type opioid receptor
LigandBDBM50007102
Substrate/Competitorn/a
Meas. Tech.ChEMBL_146518 (CHEMBL882417)
Ki 0.073000±n/a nM
Citation Wentland, MPYe, YCioffi, CLLou, RZhou, QXu, GDuan, WDehnhardt, CMSun, XCohen, DJBidlack, JM Syntheses and opioid receptor binding affinities of 8-amino-2,6-methano-3-benzazocines. J Med Chem46:838-49 (2003) 
 
Kappa-type opioid receptor
Name:Kappa-type opioid receptor
Type:G Protein-Coupled Receptor (GPCR)
Mol. Mass.:42744.99
Organism:Cavia porcellus (domestic guinea pig)
Description:P41144
Residue:380
BDBM50007102
NameBDBM50007102
Synonyms:6,11-Dimethyl-3-(tetrahydro-furan-2-ylmethyl)-1,2,3,4,5,6-hexahydro-2,6-methano-benzo[d]azocin-8-ol MR-2034
TypeSmall organic molecule
Emp. Form.C19H27NO2
Mol. Mass.301.4232
SMILESC[C@H]1[C@H]2Cc3ccc(O)cc3[C@@]1(C)CCN2C[C@@H]1CCCO1