Reaction Details
TargetDelta-type opioid receptor
LigandBDBM50124002
Substrate/Competitorn/a
Meas. Tech.ChEMBL_147150 (CHEMBL758175)
Ki 29±n/a nM
Citation Wentland, MPYe, YCioffi, CLLou, RZhou, QXu, GDuan, WDehnhardt, CMSun, XCohen, DJBidlack, JM Syntheses and opioid receptor binding affinities of 8-amino-2,6-methano-3-benzazocines. J Med Chem46:838-49 (2003) 
 
Delta-type opioid receptor
Name:Delta-type opioid receptor
Type:G Protein-Coupled Receptor (GPCR)
Mol. Mass.:40382.98
Organism:Homo sapiens (Human)
Description:Competition binding assays were carried out using membrane preparations from transfected HN9.10 cells that constitutively expressed the delta opioid receptor.
Residue:372
BDBM50124002
NameBDBM50124002
Synonyms:8-Amino-3-cyclopropylmethyl-6,11-dimethyl-3,4,5,6-tetrahydro-2H-2,6-methano-benzo[d]azocin-1-one | CHEMBL422560
TypeSmall organic molecule
Emp. Form.C18H24N2O
Mol. Mass.284.396
SMILESC[C@H]1C2N(CC3CC3)CC[C@]1(C)c1cc(N)ccc1C2=O