Reaction Details
TargetMu-type opioid receptor
LigandBDBM50085029
Substrate/Competitorn/a
Meas. Tech.ChEMBL_145281 (CHEMBL751217)
Ki 13±n/a nM
Citation Wentland, MPYe, YCioffi, CLLou, RZhou, QXu, GDuan, WDehnhardt, CMSun, XCohen, DJBidlack, JM Syntheses and opioid receptor binding affinities of 8-amino-2,6-methano-3-benzazocines. J Med Chem46:838-49 (2003) 
 
Mu-type opioid receptor
Name:Mu-type opioid receptor
Type:Enzyme Catalytic Domain
Mol. Mass.:11165.58
Organism:GUINEA PIG
Description:P97266
Residue:98
BDBM50085029
NameBDBM50085029
Synonyms:((6S,11R)-3-Cyclopropylmethyl-6,11-dimethyl-1,2,3,4,5,6-hexahydro-2,6-methano-benzo[d]azocin-8-yl)-methyl-amine (3-Cyclopropylmethyl-6,11-dimethyl-1,2,3,4,5,6-hexahydro-2,6-methano-benzo[d]azocin-8-yl)-methyl-amine.2HCl.C2H6O.H2O | CHEMBL291751
TypeSmall organic molecule
Emp. Form.C19H28N2
Mol. Mass.284.439
SMILESCNc1ccc2CC3[C@H](C)[C@](C)(CCN3CC3CC3)c2c1