Reaction Details
TargetDelta-type opioid receptor
LigandBDBM50123990
Substrate/Competitorn/a
Meas. Tech.ChEMBL_147150 (CHEMBL758175)
Ki 180±n/a nM
Citation Wentland, MPYe, YCioffi, CLLou, RZhou, QXu, GDuan, WDehnhardt, CMSun, XCohen, DJBidlack, JM Syntheses and opioid receptor binding affinities of 8-amino-2,6-methano-3-benzazocines. J Med Chem46:838-49 (2003) 
 
Delta-type opioid receptor
Name:Delta-type opioid receptor
Type:G Protein-Coupled Receptor (GPCR)
Mol. Mass.:40382.98
Organism:Homo sapiens (Human)
Description:Competition binding assays were carried out using membrane preparations from transfected HN9.10 cells that constitutively expressed the delta opioid receptor.
Residue:372
BDBM50123990
NameBDBM50123990
Synonyms:(3-Cyclopropylmethyl-6,11-dimethyl-1,2,3,4,5,6-hexahydro-2,6-methano-benzo[d]azocin-8-yl)-(4-trifluoromethyl-phenyl)-amine | CHEMBL169670
TypeSmall organic molecule
Emp. Form.C25H29F3N2
Mol. Mass.414.5064
SMILESC[C@H]1C2Cc3ccc(Nc4ccc(cc4)C(F)(F)F)cc3[C@@]1(C)CCN2CC1CC1