Reaction Details
TargetCalpain small subunit 1
LigandBDBM50124031
Substrate/Competitorn/a
Meas. Tech.ChEMBL_43863 (CHEMBL658523)
Ki 540±n/a nM
Citation Donkor, IOKorukonda, RHuang, TLLeCour, L Peptidyl aldehyde inhibitors of calpain incorporating P2-proline mimetics. Bioorg Med Chem Lett13:783-4 (2003) Calpain small subunit 1
Name:Calpain small subunit 1
Type:PROTEIN
Mol. Mass.:28062.13
Organism:Sus scrofa
Description:ChEMBL_43862
Residue:266
BDBM50124031
NameBDBM50124031
Synonyms:1-(Toluene-4-sulfonyl)-piperidine-2-carboxylic acid (1-benzyl-2-oxo-ethyl)-amide | CHEMBL163790
TypeSmall organic molecule
Emp. Form.C22H26N2O4S
Mol. Mass.414.518
SMILESCc1ccc(cc1)S(=O)(=O)N1CCCCC1C(=O)NC(Cc1ccccc1)C=O