Reaction Details
TargetCalpain small subunit 1
LigandBDBM50124032
Substrate/Competitorn/a
Meas. Tech.ChEBML_43863
Ki 70.0±n/a nM
Citation Donkor, IOKorukonda, RHuang, TLLeCour, L Peptidyl aldehyde inhibitors of calpain incorporating P2-proline mimetics. Bioorg Med Chem Lett13:783-4 (2003) Calpain small subunit 1
Name:Calpain small subunit 1
Type:PROTEIN
Mol. Mass.:28062.13
Organism:Sus scrofa
Description:ChEMBL_43862
Residue:266
BDBM50124032
NameBDBM50124032
Synonyms:3-(Toluene-4-sulfonyl)-thiazolidine-2-carboxylic acid (1-benzyl-2-oxo-ethyl)-amide | CHEMBL164347
TypeSmall organic molecule
Emp. Form.C20H22N2O4S2
Mol. Mass.418.53
SMILESCc1ccc(cc1)S(=O)(=O)N1CCSC1C(=O)NC(Cc1ccccc1)C=O