Reaction Details
TargetGenome polyprotein
LigandBDBM50124063
Substrate/Competitorn/a
Meas. Tech.ChEBML_143487
IC50 100±n/a nM
Citation Glunz, PWDouty, BDDecicco, CP Design and synthesis of bicyclic pyrimidinone-based HCV NS3 protease inhibitors. Bioorg Med Chem Lett13:785-8 (2003) Genome polyprotein
Name:Genome polyprotein
Type:Protein
Mol. Mass.:67067.41
Organism:Hepatitis C virus
Description:A3EZI9
Residue:631
BDBM50124063
NameBDBM50124063
Synonyms:2-((R)-3-{(S)-8-Methyl-4-oxo-3-(3-trifluoromethyl-benzylamino)-6-[(R)-1-((S)-6,9,9-trimethyl-3,5-dioxa-4-bora-tricyclo[6.1.1.0*2,6*]dec-4-yl)-propylcarbamoyl]-4,6,7,8-tetrahydro-pyrrolo[1,2-a]pyrimidin-8-yl}-ureido)-benzoic acid ethyl ester | CHEMBL165275
TypeSmall organic molecule
Emp. Form.C40H48BF3N6O7
Mol. Mass.792.651
SMILESCCOC(=O)c1ccccc1NC(=O)N[C@]1(C)C[C@@H](C(=O)N[C@@H](CC)B2OC3C4CC(C[C@]3(C)O2)C4(C)C)n2c1ncc(NCc1cccc(c1)C(F)(F)F)c2=O