Reaction Details
TargetGenome polyprotein
LigandBDBM50124044
Substrate/Competitorn/a
Meas. Tech.ChEBML_143487
IC50 90±n/a nM
Citation Glunz, PWDouty, BDDecicco, CP Design and synthesis of bicyclic pyrimidinone-based HCV NS3 protease inhibitors. Bioorg Med Chem Lett13:785-8 (2003) Genome polyprotein
Name:Genome polyprotein
Type:Protein
Mol. Mass.:67067.41
Organism:Hepatitis C virus
Description:A3EZI9
Residue:631
BDBM50124044
NameBDBM50124044
Synonyms:(S)-8-Methyl-8-[(3-methylsulfanyl-phenylcarbamoyl)-methyl]-4-oxo-3-(3-trifluoromethyl-benzylamino)-4,6,7,8-tetrahydro-pyrrolo[1,2-a]pyrimidine-6-carboxylic acid [(R)-1-((S)-6,9,9-trimethyl-3,5-dioxa-4-bora-tricyclo[6.1.1.0*2,6*]dec-4-yl)-propyl]-amide | CHEMBL355383
TypeSmall organic molecule
Emp. Form.C39H47BF3N5O5S
Mol. Mass.765.692
SMILESCC[C@H](NC(=O)[C@@H]1C[C@@](C)(CC(=O)Nc2cccc(SC)c2)c2ncc(NCc3cccc(c3)C(F)(F)F)c(=O)n12)B1OC2C3CC(C[C@]2(C)O1)C3(C)C