Reaction Details
TargetIntegrin alpha-4/beta-1
LigandBDBM50124274
Substrate/Competitorn/a
Meas. Tech.ChEMBL_213372 (CHEMBL817232)
IC50 2.7±n/a nM
Citation Gutteridge, CEde Laszlo, SEKamenecka, TMMcCauley, Evan Riper, GMumford, RAKidambi, UEgger, LATong, SHagmann, WK N-(3-phenylsulfonyl-3-piperidinoyl)-phenylalanine derivatives as potent, selective VLA-4 antagonists. Bioorg Med Chem Lett13:885-90 (2003) Integrin alpha-4/beta-1
Name:Integrin alpha-4/beta-1
Type:n/a
Mol. Mass.:n/a
Description:ASSAY_ID of EBI is 88912
Components:This complex has 2 components.
Component 1
Name:Integrin beta-1
Synonyms:CD_antigen=CD29 Fibronectin receptor beta GPIIA ITGB1 MDF2 | MSK12
Type:Enzyme
Mol. Mass.:88400.38
Organism:Homo sapiens (Human)
Description:P05556
Residue:798
Component 2
Name:Integrin alpha-4
Synonyms:CD49 antigen-like family member D CD49d antigen ITA4_HUMAN Integrin alpha-4 Integrin alpha-IV VLA-4 integrin alpha 4 precursor | integrin alpha-4 precursor
Type:Membrane Protein
Mol. Mass.:114897.35
Organism:Homo sapiens (Human)
Description:P13612
Residue:1032
BDBM50124274
NameBDBM50124274
Synonyms:3-(2'-Methoxy-biphenyl-4-yl)-2-{[1-((S)-toluene-2-sulfonyl)-cyclohexanecarbonyl]-amino}-propionic acid | CHEMBL354798
TypeSmall organic molecule
Emp. Form.C30H33NO6S
Mol. Mass.535.651
SMILESCOc1ccccc1-c1ccc(C[C@H](NC(=O)C2(CCCCC2)S(=O)(=O)c2ccccc2C)C(O)=O)cc1