Reaction Details
TargetIntegrin alpha-4/beta-7
LigandBDBM50124242
Substrate/Competitorn/a
Meas. Tech.ChEMBL_215741 (CHEMBL823097)
IC50 5.2±n/a nM
Citation Gutteridge, CEde Laszlo, SEKamenecka, TMMcCauley, Evan Riper, GMumford, RAKidambi, UEgger, LATong, SHagmann, WK N-(3-phenylsulfonyl-3-piperidinoyl)-phenylalanine derivatives as potent, selective VLA-4 antagonists. Bioorg Med Chem Lett13:885-90 (2003) Integrin alpha-4/beta-7
Name:Integrin alpha-4/beta-7
Type:Protein Complex
Mol. Mass.:n/a
Description:The assay uses stably transfected K562 cells expressing human alpha4beta7 integrin.
Components:This complex has 2 components.
Component 1
Name:Integrin alpha-4
Synonyms:CD49 antigen-like family member D CD49d antigen ITA4_HUMAN Integrin alpha-4 Integrin alpha-IV VLA-4 integrin alpha 4 precursor | integrin alpha-4 precursor
Type:Membrane Protein
Mol. Mass.:114897.35
Organism:Homo sapiens (Human)
Description:P13612
Residue:1032
Component 2
Name:Integrin beta-7
Synonyms:ITB7_HUMAN Integrin alpha-4/beta-7 Integrin beta7
Type:Membrane Protein
Mol. Mass.:86893.88
Organism:Homo sapiens (Human)
Description:P26010
Residue:798
BDBM50124242
NameBDBM50124242
Synonyms:2-{[3-((S)-Benzenesulfonyl)-tetrahydro-furan-3-carbonyl]-amino}-3-(2',6'-dimethoxy-biphenyl-4-yl)-propionic acid | CHEMBL352778
TypeSmall organic molecule
Emp. Form.C28H29NO8S
Mol. Mass.539.597
SMILESCOc1cccc(OC)c1-c1ccc(C[C@H](NC(=O)C2(CCOC2)S(=O)(=O)c2ccccc2)C(O)=O)cc1