Reaction Details
TargetEndothelin receptor type B
LigandBDBM50124419
Substrate/Competitorn/a
Meas. Tech.ChEBML_63699
IC50 2±n/a nM
Citation Boss, CBolli, MHWeller, TFischli, WClozel, M Bis-sulfonamides as endothelin receptor antagonists. Bioorg Med Chem Lett13:951-4 (2003) Endothelin receptor type B
Name:Endothelin receptor type B
Type:Enzyme Catalytic Domain
Mol. Mass.:49664.00
Organism:Homo sapiens (Human)
Description:ENDOTHELIN B EDNRB HUMAN::P24530
Residue:442
BDBM50124419
NameBDBM50124419
Synonyms:CHEMBL172297 | Thiophene-2-sulfonic acid {3-[6-(4-tert-butyl-benzenesulfonylamino)-2-cyclopropyl-5-(2-methoxy-phenoxy)-pyrimidin-4-yloxy]-propyl}-amide
TypeSmall organic molecule
Emp. Form.C31H36N4O7S3
Mol. Mass.672.835
SMILESCOc1ccccc1Oc1c(NS(=O)(=O)c2ccc(cc2)C(C)(C)C)nc(nc1OCCCNS(=O)(=O)c1cccs1)C1CC1