Reaction Details
TargetD(2) dopamine receptor
LigandBDBM50092046
Substrate/Competitorn/a
Meas. Tech.ChEBML_61299
Ki 21±n/a nM
Citation Zhao, HZhang, XHodgetts, KThurkauf, AHammer, JChandrasekhar, JKieltyka, ABrodbeck, RRachwal, SPrimus, RManly, C Design, synthesis, and discovery of 5-piperazinyl-1,2,6,7-tetrahydro-5H-azepino[3,2,1-hi]indol-4-one derivatives: a novel series of mixed dopamine D2/D4 receptor antagonist. Bioorg Med Chem Lett13:701-4 (2003) D(2) dopamine receptor
Name:D(2) dopamine receptor
Type:Cell-surface receptors
Mol. Mass.:50647.10
Organism:Homo sapiens (Human)
Description:P14416
Residue:443
BDBM50092046
NameBDBM50092046
Synonyms:3-[4-(4-Chloro-benzyl)-piperazin-1-yl]-1-ethyl-3,4-dihydro-1H-quinolin-2-one | CHEMBL68191
TypeSmall organic molecule
Emp. Form.C22H26ClN3O
Mol. Mass.383.914
SMILESCCN1C(=O)C(Cc2ccccc12)N1CCN(Cc2ccc(Cl)cc2)CC1